Reaction Details
TargetCorticotropin-releasing factor receptor 2
LigandBDBM50075918
Substrate/Competitorn/a
Meas. Tech.ChEBML_51277
Ki 86±n/a nM
Citation Luthin, DRRabinovich, AKBhumralkar, DRYoungblood, KLBychowski, RADhanoa, DSMay, JM Synthesis and biological activity of oxo-7H-benzo[e]perimidine-4-carboxylic acid derivatives as potent, nonpeptide corticotropin releasing factor (CRF) receptor antagonists. Bioorg Med Chem Lett9:765-70 (1999) Corticotropin-releasing factor receptor 2
Name:Corticotropin-releasing factor receptor 2
Type:PROTEIN
Mol. Mass.:47628.12
Organism:Mus musculus
Description:ChEMBL_51276
Residue:411
BDBM50075918
NameBDBM50075918
Synonyms:8N-[2-amino-(1R,2R)-cyclohexyl]-15-oxo-(9aS,13aS)-11,12,13,15-tetrahydro-10H-benzo[7,8]quinazolino[5,4-ab]phenazine-8-carboxamide | CHEMBL168162
TypeSmall organic molecule
Emp. Form.C28H30N6O2
Mol. Mass.482.5768
SMILESN[C@@H]1CCCC[C@H]1NC(=O)c1c2N[C@H]3CCCC[C@@H]3N=c2c2c(O)c3ccccc3c3ncnc1c23