Reaction Details
TargetProthrombin
LigandBDBM50075938
Substrate/Competitorn/a
Meas. Tech.ChEBML_209092
Ki 0.900000±n/a nM
Citation Zhang, MBailey, DLBastian, JABriggs, SLChirgadze, NYClawson, DKDenney, MLGifford-Moore, DSHarper, RWJohnson, LMKlimkowski, VJKohn, TJLin, HSMcCowan, JRRichett, MESall, DJSmith, AJSmith, GFSnyder, DWTakeuchi, KUtterback, BGYan, SC Dibasic benzo[b]thiophene derivatives as a novel class of active site directed thrombin inhibitors: 2. Sidechain optimization and demonstration of in vivo efficacy. Bioorg Med Chem Lett9:775-80 (1999) Prothrombin
Name:Prothrombin
Type:Protein
Mol. Mass.:70029.57
Organism:Homo sapiens (Human)
Description:P00734
Residue:622
BDBM50075938
NameBDBM50075938
Synonyms:3-(3-Methoxy-4-pyrrolidin-1-ylmethyl-benzyl)-2-[4-(2-pyrrolidin-1-yl-ethoxy)-phenyl]-benzo[b]thiophen-6-ol | CHEMBL18778
TypeSmall organic molecule
Emp. Form.C33H38N2O3S
Mol. Mass.542.731
SMILESCOc1cc(Cc2c(sc3cc(O)ccc23)-c2ccc(OCCN3CCCC3)cc2)ccc1CN1CCCC1