Reaction Details
TargetComplement C1r subcomponent
LigandBDBM50075993
Substrate/Competitorn/a
Meas. Tech.ChEMBL_48024 (CHEMBL661598)
IC50 6000±n/a nM
Citation Plummer, JSCai, CHays, SJGilmore, JLEmmerling, MRMichael, WNarasimhan, LSWatson, MDWang, KNath, REvans, LMJaen, JC Benzenesulfonamide derivatives of 2-substituted 4H-3,1-benzoxazin-4-ones and benzthiazin-4-ones as inhibitors of complement C1r protease. Bioorg Med Chem Lett9:815-20 (1999) Complement C1r subcomponent
Name:Complement C1r subcomponent
Type:Enzyme
Mol. Mass.:80113.65
Organism:Homo sapiens (Human)
Description:P00736
Residue:705
BDBM50075993
NameBDBM50075993
Synonyms:CHEMBL166632 | N-Methyl-N-(4-oxo-4H-benzo[d][1,3]oxazin-2-yl)-benzenesulfonamide
TypeSmall organic molecule
Emp. Form.C15H12N2O4S
Mol. Mass.316.332
SMILESCN(c1nc2ccccc2c(=O)o1)S(=O)(=O)c1ccccc1