Reaction Details
TargetComplement C1r subcomponent
LigandBDBM50075992
Substrate/Competitorn/a
Meas. Tech.ChEBML_48023
IC50 1500±n/a nM
Citation Plummer, JSCai, CHays, SJGilmore, JLEmmerling, MRMichael, WNarasimhan, LSWatson, MDWang, KNath, REvans, LMJaen, JC Benzenesulfonamide derivatives of 2-substituted 4H-3,1-benzoxazin-4-ones and benzthiazin-4-ones as inhibitors of complement C1r protease. Bioorg Med Chem Lett9:815-20 (1999) Complement C1r subcomponent
Name:Complement C1r subcomponent
Type:Enzyme
Mol. Mass.:80113.65
Organism:Homo sapiens (Human)
Description:P00736
Residue:705
BDBM50075992
NameBDBM50075992
Synonyms:4-Guanidino-N-methyl-N-(4-oxo-4H-benzo[d][1,3]oxazin-2-yl)-benzenesulfonamide | CHEMBL167523
TypeSmall organic molecule
Emp. Form.C16H15N5O4S
Mol. Mass.373.386
SMILES[#6]-[#7](-c1nc2ccccc2c(=O)o1)S(=O)(=O)c1ccc(cc1)\[#7]=[#6](/[#7])-[#7]