Reaction Details
TargetProthrombin
LigandBDBM50076074
Substrate/Competitorn/a
Meas. Tech.ChEBML_207969
IC50 0.505000±n/a nM
Citation Reiner, JELim-Wilby, MSBrunck, TKHa-Uong, TGoldman, EAAbelman, MANutt, RFSemple, JETamura, SY Investigation of the S3 site of thrombin: design, synthesis and biological activity of 4-substituted 3-amino-2-pyridones incorporating P1-argininals. Bioorg Med Chem Lett9:895-900 (1999) Prothrombin
Name:Prothrombin
Type:Protein
Mol. Mass.:70029.57
Organism:Homo sapiens (Human)
Description:P00734
Residue:622
BDBM50076074
NameBDBM50076074
Synonyms:1N-[1-amino(imino)methyl-6-hydroxy-(5S)-tetrahydro-5-pyridinyl]-2-(3-benzylsulfonamido-2-oxo-1,2-dihydro-1-pyridinyl)acetamide N-((S)-1-Carbamimidoyl-2-hydroxy-piperidin-3-yl)-2-(2-oxo-3-phenylmethanesulfonylamino-2H-pyridin-1-yl)-acetamide
TypeSmall organic molecule
Emp. Form.C20H26N6O5S
Mol. Mass.462.523
SMILESNC(=N)N1CCC[C@H](NC(=O)Cn2cccc(NS(=O)(=O)Cc3ccccc3)c2=O)C1O