Reaction Details
TargetIntegrase
LigandBDBM50076273
Substrate/Competitorn/a
Meas. Tech.ChEMBL_90575 (CHEMBL701159)
IC50 800±n/a nM
Citation Lin, ZNeamati, NZhao, HKiryu, YTurpin, JAAberham, CStrebel, KKohn, KWitvrouw, MPannecouque, CDebyser, ZDe Clercq, ERice, WGPommier, YBurke, TR Chicoric acid analogues as HIV-1 integrase inhibitors. J Med Chem42:1401-14 (1999) 
 
Integrase
Name:Integrase
Synonyms:Human immunodeficiency virus type 1 integrase
Type:PROTEIN
Mol. Mass.:32231.48
Organism:Human immunodeficiency virus 1
Description:ChEMBL_90865
Residue:288
BDBM50076273
NameBDBM50076273
TypeSmall organic molecule
Emp. Form.C22H18O12
Mol. Mass.474.3711
SMILESOC(=O)[C@H](OC(=O)\C=C\c1ccc(O)c(O)c1)[C@@H](OC(=O)\C=C\c1ccc(O)c(O)c1)C(O)=O