Reaction Details
TargetPlasmepsin II
LigandBDBM50076285
Substrate/Competitorn/a
Meas. Tech.ChEMBL_154909 (CHEMBL764684)
Ki 3±n/a nM
Citation Haque, TSSkillman, AGLee, CEHabashita, HGluzman, IYEwing, TJGoldberg, DEKuntz, IDEllman, JA Potent, low-molecular-weight non-peptide inhibitors of malarial aspartyl protease plasmepsin II. J Med Chem42:1428-40 (1999) 
 
Plasmepsin II
Name:Plasmepsin II
Type:Enzyme
Mol. Mass.:51482.09
Organism:Plasmodium falciparum
Description:P46925
Residue:453
BDBM50076285
NameBDBM50076285
Synonyms:1-Acetyl-piperidine-4-carboxylic acid (2-benzo[1,3]dioxol-5-yl-ethyl)-{(2S,3S)-3-[2-(3-chloro-phenylamino)-acetylamino]-2-hydroxy-4-phenyl-butyl}-amide | CHEMBL34323
TypeSmall organic molecule
Emp. Form.C35H41ClN4O6
Mol. Mass.649.176
SMILESCC(=O)N1CCC(CC1)C(=O)N(CCc1ccc2OCOc2c1)C[C@H](O)[C@H](Cc1ccccc1)NC(=O)CNc1cccc(Cl)c1