Reaction Details
TargetPlasmepsin II
LigandBDBM50076290
Substrate/Competitorn/a
Meas. Tech.ChEMBL_154909 (CHEMBL764684)
Ki 300±n/a nM
Citation Haque, TSSkillman, AGLee, CEHabashita, HGluzman, IYEwing, TJGoldberg, DEKuntz, IDEllman, JA Potent, low-molecular-weight non-peptide inhibitors of malarial aspartyl protease plasmepsin II. J Med Chem42:1428-40 (1999) 
 
Plasmepsin II
Name:Plasmepsin II
Type:Enzyme
Mol. Mass.:51482.09
Organism:Plasmodium falciparum
Description:P46925
Residue:453
BDBM50076290
NameBDBM50076290
Synonyms:CHEMBL284151 | N-(2-Benzo[1,3]dioxol-5-yl-ethyl)-N-{(2S,3S)-3-[2-(2,5-dimethyl-phenoxy)-acetylamino]-2-hydroxy-4-phenyl-butyl}-3-(dioxo-1,3-dihydro-isoindol-2-yl)-propionamide
TypeSmall organic molecule
Emp. Form.C40H41N3O8
Mol. Mass.691.7688
SMILESCc1ccc(C)c(OCC(=O)N[C@@H](Cc2ccccc2)[C@@H](O)CN(CCc2ccc3OCOc3c2)C(=O)CCN2C(=O)c3ccccc3C2=O)c1