Reaction Details
TargetStromelysin-1
LigandBDBM50076334
Substrate/Competitorn/a
Meas. Tech.ChEMBL_104736 (CHEMBL710736)
Ki 490.0±n/a nM
Citation Jacobsen, EJMitchell, MAHendges, SKBelonga, KLSkaletzky, LLStelzer, LSLindberg, TJFritzen, ELSchostarez, HJO'Sullivan, TJMaggiora, LLStuchly, CWLaborde, ALKubicek, MFPoorman, RABeck, JMMiller, HRPetzold, GLScott, PSTruesdell, SEWallace, TLWilks, JWFisher, CGoodman, LVKaytes, PS Synthesis of a series of stromelysin-selective thiadiazole urea matrix metalloproteinase inhibitors. J Med Chem42:1525-36 (1999) 
 
Stromelysin-1
Name:Stromelysin-1
Type:Enzyme
Mol. Mass.:53973.13
Organism:Homo sapiens (Human)
Description: P08254
Residue:477
BDBM50076334
NameBDBM50076334
Synonyms:(S)-N-(3,4-Dimethoxy-benzyl)-3-phenyl-2-[3-(5-thioxo-4,5-dihydro-[1,3,4]thiadiazol-2-yl)-ureido]-propionamide | CHEMBL287974
TypeSmall organic molecule
Emp. Form.C21H23N5O4S2
Mol. Mass.473.568
SMILESCOc1ccc(CNC(=O)[C@H](Cc2ccccc2)NC(=O)Nc2nnc(S)s2)cc1OC