Reaction Details
TargetStromelysin-1
LigandBDBM50076333
Substrate/Competitorn/a
Meas. Tech.ChEMBL_104736 (CHEMBL710736)
Ki 3200±n/a nM
Citation Jacobsen, EJMitchell, MAHendges, SKBelonga, KLSkaletzky, LLStelzer, LSLindberg, TJFritzen, ELSchostarez, HJO'Sullivan, TJMaggiora, LLStuchly, CWLaborde, ALKubicek, MFPoorman, RABeck, JMMiller, HRPetzold, GLScott, PSTruesdell, SEWallace, TLWilks, JWFisher, CGoodman, LVKaytes, PS Synthesis of a series of stromelysin-selective thiadiazole urea matrix metalloproteinase inhibitors. J Med Chem42:1525-36 (1999) 
 
Stromelysin-1
Name:Stromelysin-1
Type:Enzyme
Mol. Mass.:53973.13
Organism:Homo sapiens (Human)
Description: P08254
Residue:477
BDBM50076333
NameBDBM50076333
Synonyms:(S)-3-Phenyl-2-[3-(5-thioxo-4,5-dihydro-[1,3,4]thiadiazol-2-yl)-ureido]-propionic acid | CHEMBL288866
TypeSmall organic molecule
Emp. Form.C12H12N4O3S2
Mol. Mass.324.379
SMILESOC(=O)[C@H](Cc1ccccc1)NC(=O)Nc1nnc(S)s1