Reaction Details
TargetInterstitial collagenase
LigandBDBM50076342
Substrate/Competitorn/a
Meas. Tech.ChEMBL_106319 (CHEMBL714731)
Ki 1500±n/a nM
Citation Jacobsen, EJMitchell, MAHendges, SKBelonga, KLSkaletzky, LLStelzer, LSLindberg, TJFritzen, ELSchostarez, HJO'Sullivan, TJMaggiora, LLStuchly, CWLaborde, ALKubicek, MFPoorman, RABeck, JMMiller, HRPetzold, GLScott, PSTruesdell, SEWallace, TLWilks, JWFisher, CGoodman, LVKaytes, PS Synthesis of a series of stromelysin-selective thiadiazole urea matrix metalloproteinase inhibitors. J Med Chem42:1525-36 (1999) 
 
Interstitial collagenase
Name:Interstitial collagenase
Type:Enzyme
Mol. Mass.:54010.26
Organism:Homo sapiens (Human)
Description: P03956
Residue:469
BDBM50076342
NameBDBM50076342
Synonyms:1-[(S)-1-Benzyl-2-oxo-2-(4-pyridin-2-yl-piperazin-1-yl)-ethyl]-3-(5-thioxo-4,5-dihydro-[1,3,4]thiadiazol-2-yl)-urea | CHEMBL290857
TypeSmall organic molecule
Emp. Form.C21H23N7O2S2
Mol. Mass.469.583
SMILESSc1nnc(NC(=O)N[C@@H](Cc2ccccc2)C(=O)N2CCN(CC2)c2ccccn2)s1