Reaction Details
TargetInterstitial collagenase
LigandBDBM50076382
Substrate/Competitorn/a
Meas. Tech.ChEMBL_106319 (CHEMBL714731)
Ki 15000±n/a nM
Citation Jacobsen, EJMitchell, MAHendges, SKBelonga, KLSkaletzky, LLStelzer, LSLindberg, TJFritzen, ELSchostarez, HJO'Sullivan, TJMaggiora, LLStuchly, CWLaborde, ALKubicek, MFPoorman, RABeck, JMMiller, HRPetzold, GLScott, PSTruesdell, SEWallace, TLWilks, JWFisher, CGoodman, LVKaytes, PS Synthesis of a series of stromelysin-selective thiadiazole urea matrix metalloproteinase inhibitors. J Med Chem42:1525-36 (1999) 
 
Interstitial collagenase
Name:Interstitial collagenase
Type:Enzyme
Mol. Mass.:54010.26
Organism:Homo sapiens (Human)
Description: P03956
Residue:469
BDBM50076382
NameBDBM50076382
Synonyms:(S)-N-Benzyl-3-phenyl-2-[3-(5-thioxo-4,5-dihydro-[1,3,4]thiadiazol-2-yl)-ureido]-propionamide | CHEMBL39726
TypeSmall organic molecule
Emp. Form.C19H19N5O2S2
Mol. Mass.413.516
SMILESSc1nnc(NC(=O)N[C@@H](Cc2ccccc2)C(=O)NCc2ccccc2)s1