Reaction Details
Target5-hydroxytryptamine receptor 1A
LigandBDBM50076428
Substrate/Competitorn/a
Meas. Tech.ChEMBL_937 (CHEMBL616302)
Ki 0.515000±n/a nM
Citation Lang, LJagoda, ESchmall, BVuong, BKAdams, HRNelson, DLCarson, REEckelman, WC Development of fluorine-18-labeled 5-HT1A antagonists. J Med Chem42:1576-86 (1999) 
 
5-hydroxytryptamine receptor 1A
Name:5-hydroxytryptamine receptor 1A
Type:n/a
Mol. Mass.:46122.49
Organism:Homo sapiens (Human)
Description:n/a
Residue:422
BDBM50076428
NameBDBM50076428
Synonyms:4-Fluoro-cyclohexanecarboxylic acid {2-[4-(2-methoxy-phenyl)-piperazin-1-yl]-ethyl}-pyridin-2-yl-amide | CHEMBL38413
TypeSmall organic molecule
Emp. Form.C25H33FN4O2
Mol. Mass.440.5535
SMILESCOc1ccccc1N1CCN(CCN(C(=O)C2CCC(F)CC2)c2ccccn2)CC1