Reaction Details
TargetCorticotropin-releasing factor receptor 1
LigandBDBM50076615
Substrate/Competitorn/a
Meas. Tech.ChEBML_50955
Ki 7.6±n/a nM
Citation Beck, JPArvanitis, AGCurry, MARescinito, JTFitzgerald, LWGilligan, PJZaczek, RTrainor, GL Purin-8-ones as corticotropin-releasing hormone (CRH-R1) receptor antagonists. Bioorg Med Chem Lett9:967-72 (1999) Corticotropin-releasing factor receptor 1
Name:Corticotropin-releasing factor receptor 1
Type:Enzyme
Mol. Mass.:50744.31
Organism:Homo sapiens (Human)
Description:P34998
Residue:444
BDBM50076615
NameBDBM50076615
Synonyms:9-(2-Bromo-4-isopropyl-phenyl)-6-dipropylamino-2,7-dimethyl-7,9-dihydro-purin-8-one | CHEMBL426044
TypeSmall organic molecule
Emp. Form.C22H30BrN5O
Mol. Mass.460.411
SMILESCCCN(CCC)c1nc(C)nc2n(-c3ccc(cc3Br)C(C)C)c(=O)n(C)c12