Reaction Details
TargetPolyunsaturated fatty acid 5-lipoxygenase
LigandBDBM50076661
Substrate/Competitorn/a
Meas. Tech.ChEMBL_4159 (CHEMBL619226)
IC50 10700±n/a nM
Citation Connolly, PJWetter, SKBeers, KNHamel, SCChen, RHWachter, MPAnsell, JSinger, MMSteber, MRitchie, DMArgentieri, DC N-hydroxyurea and hydroxamic acid inhibitors of cyclooxygenase and 5-lipoxygenase. Bioorg Med Chem Lett9:979-84 (1999) Polyunsaturated fatty acid 5-lipoxygenase
Name:Polyunsaturated fatty acid 5-lipoxygenase
Type:PROTEIN
Mol. Mass.:78082.31
Organism:Rattus norvegicus
Description:ChEMBL_1432947
Residue:673
BDBM50076661
NameBDBM50076661
Synonyms:CHEMBL177727 | N-{1-Ethyl-3-[1-(4-methoxy-phenyl)-5-p-tolyl-1H-pyrazol-3-yl]-prop-2-ynyl}-N-hydroxy-acetamide
TypeSmall organic molecule
Emp. Form.C24H25N3O3
Mol. Mass.403.4736
SMILESCCC(C#Cc1cc(-c2ccc(C)cc2)n(n1)-c1ccc(OC)cc1)N(O)C(C)=O