Reaction Details
TargetPolyunsaturated fatty acid 5-lipoxygenase
LigandBDBM50076666
Substrate/Competitorn/a
Meas. Tech.ChEMBL_4160 (CHEMBL619227)
IC50 80±n/a nM
Citation Connolly, PJWetter, SKBeers, KNHamel, SCChen, RHWachter, MPAnsell, JSinger, MMSteber, MRitchie, DMArgentieri, DC N-hydroxyurea and hydroxamic acid inhibitors of cyclooxygenase and 5-lipoxygenase. Bioorg Med Chem Lett9:979-84 (1999) Polyunsaturated fatty acid 5-lipoxygenase
Name:Polyunsaturated fatty acid 5-lipoxygenase
Type:PROTEIN
Mol. Mass.:78082.31
Organism:Rattus norvegicus
Description:ChEMBL_1432947
Residue:673
BDBM50076666
NameBDBM50076666
Synonyms:CHEMBL175153 | N-Hydroxy-N-{3-[1-(4-methoxy-phenyl)-5-p-tolyl-1H-pyrazol-3-yl]-1-methyl-prop-2-ynyl}-acetamide
TypeSmall organic molecule
Emp. Form.C23H23N3O3
Mol. Mass.389.447
SMILESCOc1ccc(cc1)-n1nc(cc1-c1ccc(C)cc1)C#CC(C)N(O)C(C)=O