Reaction Details
TargetAndrogen receptor
LigandBDBM50403731
Substrate/Competitorn/a
Meas. Tech.ChEMBL_35937 (CHEMBL646845)
EC50 16±n/a nM
Citation Edwards, JPHiguchi, RIWinn, DTPooley, CLCaferro, TRHamann, LGZhi, LMarschke, KBGoldman, MEJones, TK Nonsteroidal androgen receptor agonists based on 4-(trifluoromethyl)-2H-pyrano[3,2-g]quinolin-2-one. Bioorg Med Chem Lett9:1003-8 (1999) Androgen receptor
Name:Androgen receptor
Type:Receptor
Mol. Mass.:99185.27
Organism:Homo sapiens (Human)
Description:CHO cells were stably transfected with human AR gene.
Residue:920
BDBM50403731
NameBDBM50403731
Synonyms:CHEMBL2112216
TypeSmall organic molecule
Emp. Form.C16H16F3NO2
Mol. Mass.311.2989
SMILESCC[C@H]1C[C@@H](C)Nc2cc3oc(=O)cc(c3cc12)C(F)(F)F