Reaction Details
TargetAndrogen receptor
LigandBDBM50403729
Substrate/Competitorn/a
Meas. Tech.ChEMBL_36117 (CHEMBL648082)
IC50 2±n/a nM
Citation Edwards, JPHiguchi, RIWinn, DTPooley, CLCaferro, TRHamann, LGZhi, LMarschke, KBGoldman, MEJones, TK Nonsteroidal androgen receptor agonists based on 4-(trifluoromethyl)-2H-pyrano[3,2-g]quinolin-2-one. Bioorg Med Chem Lett9:1003-8 (1999) Androgen receptor
Name:Androgen receptor
Type:Receptor
Mol. Mass.:99185.27
Organism:Homo sapiens (Human)
Description:CHO cells were stably transfected with human AR gene.
Residue:920
BDBM50403729
NameBDBM50403729
Synonyms:CHEMBL2112311
TypeSmall organic molecule
Emp. Form.C16H16F3NO2
Mol. Mass.311.2989
SMILESCC[C@@H]1[C@H](C)CNc2cc3oc(=O)cc(c3cc12)C(F)(F)F