Reaction Details
TargetAndrogen receptor
LigandBDBM50076691
Substrate/Competitorn/a
Meas. Tech.ChEBML_35936
IC50 1±n/a nM
Citation Edwards, JPHiguchi, RIWinn, DTPooley, CLCaferro, TRHamann, LGZhi, LMarschke, KBGoldman, MEJones, TK Nonsteroidal androgen receptor agonists based on 4-(trifluoromethyl)-2H-pyrano[3,2-g]quinolin-2-one. Bioorg Med Chem Lett9:1003-8 (1999) Androgen receptor
Name:Androgen receptor
Type:Receptor
Mol. Mass.:99185.27
Organism:Homo sapiens (Human)
Description:CHO cells were stably transfected with human AR gene.
Residue:920
BDBM50076691
NameBDBM50076691
Synonyms:7,7-Dimethyl-4-trifluoromethyl-5,6,7,8-tetrahydro-1-oxa-8-aza-anthracen-2-one | CHEMBL7289
TypeSmall organic molecule
Emp. Form.C15H14F3NO2
Mol. Mass.297.2724
SMILESCC1(C)CCc2cc3c(cc(=O)oc3cc2N1)C(F)(F)F