Reaction Details
TargetAndrogen receptor
LigandBDBM50076696
Substrate/Competitorn/a
Meas. Tech.ChEMBL_36116 (CHEMBL648081)
IC50>10±n/a nM
Citation Edwards, JPHiguchi, RIWinn, DTPooley, CLCaferro, TRHamann, LGZhi, LMarschke, KBGoldman, MEJones, TK Nonsteroidal androgen receptor agonists based on 4-(trifluoromethyl)-2H-pyrano[3,2-g]quinolin-2-one. Bioorg Med Chem Lett9:1003-8 (1999) Androgen receptor
Name:Androgen receptor
Type:Receptor
Mol. Mass.:99185.27
Organism:Homo sapiens (Human)
Description:CHO cells were stably transfected with human AR gene.
Residue:920
BDBM50076696
NameBDBM50076696
Synonyms:CHEMBL6721 | trans-5,7-Diethyl-4-trifluoromethyl-5,6,7,8-tetrahydro-1-oxa-8-aza-anthracen-2-one
TypeSmall organic molecule
Emp. Form.C17H18F3NO2
Mol. Mass.325.3255
SMILESCCC1CC(CC)c2cc3c(cc(=O)oc3cc2N1)C(F)(F)F