Reaction Details
TargetAndrogen receptor
LigandBDBM50076697
Substrate/Competitorn/a
Meas. Tech.ChEMBL_35936 (CHEMBL646844)
EC50 19±n/a nM
Citation Edwards, JPHiguchi, RIWinn, DTPooley, CLCaferro, TRHamann, LGZhi, LMarschke, KBGoldman, MEJones, TK Nonsteroidal androgen receptor agonists based on 4-(trifluoromethyl)-2H-pyrano[3,2-g]quinolin-2-one. Bioorg Med Chem Lett9:1003-8 (1999) Androgen receptor
Name:Androgen receptor
Type:Receptor
Mol. Mass.:99185.27
Organism:Homo sapiens (Human)
Description:CHO cells were stably transfected with human AR gene.
Residue:920
BDBM50076697
NameBDBM50076697
Synonyms:4-Trifluoromethyl-5,6,7,8-tetrahydro-1-oxa-8-aza-anthracen-2-one | CHEMBL268098
TypeSmall organic molecule
Emp. Form.C13H10F3NO2
Mol. Mass.269.2192
SMILESFC(F)(F)c1cc(=O)oc2cc3NCCCc3cc12