Reaction Details
TargetProgesterone receptor
LigandBDBM50076691
Substrate/Competitorn/a
Meas. Tech.ChEBML_159382
IC50 570±n/a nM
Citation Edwards, JPHiguchi, RIWinn, DTPooley, CLCaferro, TRHamann, LGZhi, LMarschke, KBGoldman, MEJones, TK Nonsteroidal androgen receptor agonists based on 4-(trifluoromethyl)-2H-pyrano[3,2-g]quinolin-2-one. Bioorg Med Chem Lett9:1003-8 (1999) Progesterone receptor
Name:Progesterone receptor
Type:Protein
Mol. Mass.:98979.52
Organism:Homo sapiens (Human)
Description:P06401
Residue:933
BDBM50076691
NameBDBM50076691
Synonyms:7,7-Dimethyl-4-trifluoromethyl-5,6,7,8-tetrahydro-1-oxa-8-aza-anthracen-2-one | CHEMBL7289
TypeSmall organic molecule
Emp. Form.C15H14F3NO2
Mol. Mass.297.2724
SMILESCC1(C)CCc2cc3c(cc(=O)oc3cc2N1)C(F)(F)F