Reaction Details
TargetAndrogen receptor
LigandBDBM50076689
Substrate/Competitorn/a
Meas. Tech.ChEMBL_36117 (CHEMBL648082)
IC50 276±n/a nM
Citation Edwards, JPHiguchi, RIWinn, DTPooley, CLCaferro, TRHamann, LGZhi, LMarschke, KBGoldman, MEJones, TK Nonsteroidal androgen receptor agonists based on 4-(trifluoromethyl)-2H-pyrano[3,2-g]quinolin-2-one. Bioorg Med Chem Lett9:1003-8 (1999) Androgen receptor
Name:Androgen receptor
Type:Receptor
Mol. Mass.:99185.27
Organism:Homo sapiens (Human)
Description:CHO cells were stably transfected with human AR gene.
Residue:920
BDBM50076689
NameBDBM50076689
Synonyms:5-Ethyl-8-methyl-4-trifluoromethyl-5,6,7,8-tetrahydro-1-oxa-8-aza-anthracen-2-one | CHEMBL6530
TypeSmall organic molecule
Emp. Form.C16H16F3NO2
Mol. Mass.311.2989
SMILESCCC1CCN(C)c2cc3oc(=O)cc(c3cc12)C(F)(F)F