Reaction Details
TargetProgesterone receptor
LigandBDBM50403729
Substrate/Competitorn/a
Meas. Tech.ChEBML_159382
IC50 130±n/a nM
Citation Edwards, JPHiguchi, RIWinn, DTPooley, CLCaferro, TRHamann, LGZhi, LMarschke, KBGoldman, MEJones, TK Nonsteroidal androgen receptor agonists based on 4-(trifluoromethyl)-2H-pyrano[3,2-g]quinolin-2-one. Bioorg Med Chem Lett9:1003-8 (1999) Progesterone receptor
Name:Progesterone receptor
Type:Protein
Mol. Mass.:98979.52
Organism:Homo sapiens (Human)
Description:P06401
Residue:933
BDBM50403729
NameBDBM50403729
Synonyms:CHEMBL2112311
TypeSmall organic molecule
Emp. Form.C16H16F3NO2
Mol. Mass.311.2989
SMILESCC[C@@H]1[C@H](C)CNc2cc3oc(=O)cc(c3cc12)C(F)(F)F