Reaction Details
TargetCorticotropin-releasing factor receptor 1
LigandBDBM50076764
Substrate/Competitorn/a
Meas. Tech.ChEBML_50975
Ki 2.5±n/a nM
Citation Cocuzza, AJHobbs, FWArnold, CRChidester, DRYarem, JACulp, SFitzgerald, LGilligan, PJ 4-Aryl-2-anilinopyrimidines as corticotropin-releasing hormone (CRH) antagonists. Bioorg Med Chem Lett9:1057-62 (1999) Corticotropin-releasing factor receptor 1
Name:Corticotropin-releasing factor receptor 1
Type:Enzyme
Mol. Mass.:50744.31
Organism:Homo sapiens (Human)
Description:P34998
Residue:444
BDBM50076764
NameBDBM50076764
Synonyms:(2-Bromo-4-methylsulfanyl-phenyl)-ethyl-[4-methyl-6-(2-trifluoromethyl-phenyl)-pyrimidin-2-yl]-amine | CHEMBL274578
TypeSmall organic molecule
Emp. Form.C21H19BrF3N3S
Mol. Mass.482.36
SMILESCCN(c1nc(C)cc(n1)-c1ccccc1C(F)(F)F)c1ccc(SC)cc1Br