Reaction Details
TargetCorticotropin-releasing factor receptor 1
LigandBDBM50076898
Substrate/Competitorn/a
Meas. Tech.ChEBML_51119
Ki 16±n/a nM
Citation Beck, JPCurry, MAChorvat, RJFitzgerald, LWGilligan, PJZaczek, RTrainor, GL Thiazolo[4,5-d]pyrimidine thiones and -ones as corticotropin-releasing hormone (CRH-R1) receptor antagonists. Bioorg Med Chem Lett9:1185-8 (1999) Corticotropin-releasing factor receptor 1
Name:Corticotropin-releasing factor receptor 1
Type:Enzyme
Mol. Mass.:50744.31
Organism:Homo sapiens (Human)
Description:P34998
Residue:444
BDBM50076898
NameBDBM50076898
Synonyms:7-(Cyclopropylmethyl-propyl-amino)-5-methyl-3-(2,4,6-trimethyl-phenyl)-3H-thiazolo[4,5-d]pyrimidin-2-one | CHEMBL18590
TypeSmall organic molecule
Emp. Form.C22H28N4OS
Mol. Mass.396.549
SMILESCCCN(CC1CC1)c1nc(C)nc2n(-c3c(C)cc(C)cc3C)c(=O)sc12