Reaction Details
TargetCorticotropin-releasing factor receptor 1
LigandBDBM50076899
Substrate/Competitorn/a
Meas. Tech.ChEMBL_51119 (CHEMBL665732)
Ki 6.6±n/a nM
Citation Beck, JPCurry, MAChorvat, RJFitzgerald, LWGilligan, PJZaczek, RTrainor, GL Thiazolo[4,5-d]pyrimidine thiones and -ones as corticotropin-releasing hormone (CRH-R1) receptor antagonists. Bioorg Med Chem Lett9:1185-8 (1999) Corticotropin-releasing factor receptor 1
Name:Corticotropin-releasing factor receptor 1
Type:Enzyme
Mol. Mass.:50744.31
Organism:Homo sapiens (Human)
Description:P34998
Residue:444
BDBM50076899
NameBDBM50076899
Synonyms:7-[Bis-(2-methoxy-ethyl)-amino]-3-(2-bromo-4-isopropyl-phenyl)-5-methyl-3H-thiazolo[4,5-d]pyrimidine-2-thione | CHEMBL559127
TypeSmall organic molecule
Emp. Form.C21H27BrN4O2S2
Mol. Mass.511.499
SMILESCOCCN(CCOC)c1nc(C)nc2n(-c3ccc(cc3Br)C(C)C)c(=S)sc12