Reaction Details
TargetCorticotropin-releasing factor receptor 1
LigandBDBM50076905
Substrate/Competitorn/a
Meas. Tech.ChEMBL_51119 (CHEMBL665732)
Ki 4.1±n/a nM
Citation Beck, JPCurry, MAChorvat, RJFitzgerald, LWGilligan, PJZaczek, RTrainor, GL Thiazolo[4,5-d]pyrimidine thiones and -ones as corticotropin-releasing hormone (CRH-R1) receptor antagonists. Bioorg Med Chem Lett9:1185-8 (1999) Corticotropin-releasing factor receptor 1
Name:Corticotropin-releasing factor receptor 1
Type:Enzyme
Mol. Mass.:50744.31
Organism:Homo sapiens (Human)
Description:P34998
Residue:444
BDBM50076905
NameBDBM50076905
Synonyms:3-(2-Bromo-4-isopropyl-phenyl)-7-diethylamino-5-methyl-3H-thiazolo[4,5-d]pyrimidine-2-thione | CHEMBL18029
TypeSmall organic molecule
Emp. Form.C19H23BrN4S2
Mol. Mass.451.447
SMILESCCN(CC)c1nc(C)nc2n(-c3ccc(cc3Br)C(C)C)c(=S)sc12