Reaction Details
TargetOxytocin receptor
LigandBDBM50077035
Substrate/Competitorn/a
Meas. Tech.ChEBML_149179
Ki 0.600000±n/a nM
Citation Williams, PDBock, MGEvans, BEFreidinger, RMGallicchio, SNGuidotti, MTJacobson, MAKuo, MSLevy, MRLis, EVMichelson, SRPawluczyk, JMPerlow, DSPettibone, DJQuigley, AGReiss, DRSalvatore, CStauffer, KJWoyden, CJ Nonpeptide oxytocin antagonists: analogs of L-371,257 with improved potency. Bioorg Med Chem Lett9:1311-6 (1999) Oxytocin receptor
Name:Oxytocin receptor
Type:Enzyme Catalytic Domain
Mol. Mass.:42889.28
Organism:RAT
Description:Oxytocin OXTR RAT::P70536
Residue:388
BDBM50077035
NameBDBM50077035
Synonyms:1-(1-{2-[4-Morpholin-4-yl-2-(2,2,2-trifluoro-ethoxy)-phenyl]-acetyl}-piperidin-4-yl)-1,4-dihydro-benzo[d][1,3]oxazin-2-one | CHEMBL25353
TypeSmall organic molecule
Emp. Form.C27H30F3N3O5
Mol. Mass.533.5394
SMILESFC(F)(F)COc1cc(ccc1CC(=O)N1CCC(CC1)N1C(=O)OCc2ccccc12)N1CCOCC1