Reaction Details
TargetDelta-type opioid receptor
LigandBDBM50077088
Substrate/Competitorn/a
Meas. Tech.ChEBML_217735
IC50 29±n/a nM
Citation Barn, DRBom, ACottney, JCaulfield, WLMorphy, JR Synthesis of novel analogues of the delta opioid ligand SNC-80 using AlCl3-promoted aminolysis. Bioorg Med Chem Lett9:1329-34 (1999) Delta-type opioid receptor
Name:Delta-type opioid receptor
Type:G Protein-Coupled Receptor (GPCR)
Mol. Mass.:40382.98
Organism:Homo sapiens (Human)
Description:Competition binding assays were carried out using membrane preparations from transfected HN9.10 cells that constitutively expressed the delta opioid receptor.
Residue:372
BDBM50077088
NameBDBM50077088
Synonyms:CHEMBL27579 | N,N-Diethyl-4-[(octahydro-quinoxalin-1-yl)-phenyl-methyl]-benzamide
TypeSmall organic molecule
Emp. Form.C26H35N3O
Mol. Mass.405.5756
SMILESCCN(CC)C(=O)c1ccc(cc1)C(N1CCNC2CCCCC12)c1ccccc1