Reaction Details
TargetDelta-type opioid receptor
LigandBDBM50077066
Substrate/Competitorn/a
Meas. Tech.ChEMBL_145335 (CHEMBL750570)
IC50 8±n/a nM
Citation Barn, DRBom, ACottney, JCaulfield, WLMorphy, JR Synthesis of novel analogues of the delta opioid ligand SNC-80 using AlCl3-promoted aminolysis. Bioorg Med Chem Lett9:1329-34 (1999) Delta-type opioid receptor
Name:Delta-type opioid receptor
Type:G Protein-Coupled Receptor (GPCR)
Mol. Mass.:40382.98
Organism:Homo sapiens (Human)
Description:Competition binding assays were carried out using membrane preparations from transfected HN9.10 cells that constitutively expressed the delta opioid receptor.
Residue:372
BDBM50077066
NameBDBM50077066
Synonyms:4-[(4-Allyl-piperazin-1-yl)-phenyl-methyl]-N,N-diethyl-benzamide CHEMBL544641
TypeSmall organic molecule
Emp. Form.C25H33N3O
Mol. Mass.391.549
SMILESCCN(CC)C(=O)c1ccc(cc1)C(N1CCN(CC=C)CC1)c1ccccc1