Reaction Details
TargetMatrix metalloproteinase-9
LigandBDBM50077157
Substrate/Competitorn/a
Meas. Tech.ChEMBL_105524 (CHEMBL715233)
IC50 7.3±n/a nM
Citation Kiyama, RTamura, YWatanabe, FTsuzuki, HOhtani, MYodo, M Homology modeling of gelatinase catalytic domains and docking simulations of novel sulfonamide inhibitors. J Med Chem42:1723-38 (1999) 
 
Matrix metalloproteinase-9
Name:Matrix metalloproteinase-9
Type:Enzyme
Mol. Mass.:78452.28
Organism:Homo sapiens (Human)
Description:P14780
Residue:707
BDBM50077157
NameBDBM50077157
Synonyms:(R)-2-[5-(4-Ethyl-phenylethynyl)-thiophene-2-sulfonylamino]-3-(1H-indol-3-yl)-propionic acid | CHEMBL47971
TypeSmall organic molecule
Emp. Form.C25H22N2O4S2
Mol. Mass.478.583
SMILESCCc1ccc(cc1)C#Cc1ccc(s1)S(=O)(=O)N[C@H](Cc1c[nH]c2ccccc12)C(O)=O