Reaction Details
Target72 kDa type IV collagenase
LigandBDBM50077153
Substrate/Competitorn/a
Meas. Tech.ChEMBL_104552 (CHEMBL718938)
IC50 20±n/a nM
Citation Kiyama, RTamura, YWatanabe, FTsuzuki, HOhtani, MYodo, M Homology modeling of gelatinase catalytic domains and docking simulations of novel sulfonamide inhibitors. J Med Chem42:1723-38 (1999) 
 
72 kDa type IV collagenase
Name:72 kDa type IV collagenase
Type:Enzyme
Mol. Mass.:73870.36
Organism:Homo sapiens (Human)
Description: P08253
Residue:660
BDBM50077153
NameBDBM50077153
Synonyms:(R)-3-Phenyl-2-(4-phenylethynyl-benzenesulfonylamino)-propionic acid | CHEMBL49186
TypeSmall organic molecule
Emp. Form.C23H19NO4S
Mol. Mass.405.466
SMILESOC(=O)[C@@H](Cc1ccccc1)NS(=O)(=O)c1ccc(cc1)C#Cc1ccccc1