Reaction Details
TargetEpidermal growth factor receptor
LigandBDBM50077243
Substrate/Competitorn/a
Meas. Tech.ChEMBL_66576 (CHEMBL856168)
IC50 1.6±n/a nM
Citation Smaill, JBPalmer, BDRewcastle, GWDenny, WAMcNamara, DJDobrusin, EMBridges, AJZhou, HShowalter, HDWinters, RTLeopold, WRFry, DWNelson, JMSlintak, VElliot, WLRoberts, BJVincent, PWPatmore, SJ Tyrosine kinase inhibitors. 15. 4-(Phenylamino)quinazoline and 4-(phenylamino)pyrido[d]pyrimidine acrylamides as irreversible inhibitors of the ATP binding site of the epidermal growth factor receptor. J Med Chem42:1803-15 (1999) 
 
Epidermal growth factor receptor
Name:Epidermal growth factor receptor
Type:Receptor Kinase Domain
Mol. Mass.:134279.59
Organism:Homo sapiens (Human)
Description:P00533
Residue:1210
BDBM50077243
NameBDBM50077243
Synonyms:CHEMBL53637 | N-[4-(3-Chloro-phenylamino)-quinazolin-6-yl]-acrylamide
TypeSmall organic molecule
Emp. Form.C17H13ClN4O
Mol. Mass.324.764
SMILESClc1cccc(Nc2ncnc3ccc(NC(=O)C=C)cc23)c1