Reaction Details
TargetEpidermal growth factor receptor
LigandBDBM50077230
Substrate/Competitorn/a
Meas. Tech.ChEMBL_64442 (CHEMBL674017)
IC50 5.6±n/a nM
Citation Smaill, JBPalmer, BDRewcastle, GWDenny, WAMcNamara, DJDobrusin, EMBridges, AJZhou, HShowalter, HDWinters, RTLeopold, WRFry, DWNelson, JMSlintak, VElliot, WLRoberts, BJVincent, PWPatmore, SJ Tyrosine kinase inhibitors. 15. 4-(Phenylamino)quinazoline and 4-(phenylamino)pyrido[d]pyrimidine acrylamides as irreversible inhibitors of the ATP binding site of the epidermal growth factor receptor. J Med Chem42:1803-15 (1999) 
 
Epidermal growth factor receptor
Name:Epidermal growth factor receptor
Type:Receptor Kinase Domain
Mol. Mass.:134279.59
Organism:Homo sapiens (Human)
Description:P00533
Residue:1210
BDBM50077230
NameBDBM50077230
Synonyms:CHEMBL296168 | N-[4-(3-Bromo-phenylamino)-pyrido[3,2-d]pyrimidin-6-yl]-acrylamide
TypeSmall organic molecule
Emp. Form.C16H12BrN5O
Mol. Mass.370.203
SMILESBrc1cccc(Nc2ncnc3ccc(NC(=O)C=C)nc23)c1