Reaction Details
TargetReceptor tyrosine-protein kinase erbB-2
LigandBDBM50077236
Substrate/Competitorn/a
Meas. Tech.ChEMBL_65259 (CHEMBL673950)
IC50 8.8±n/a nM
Citation Smaill, JBPalmer, BDRewcastle, GWDenny, WAMcNamara, DJDobrusin, EMBridges, AJZhou, HShowalter, HDWinters, RTLeopold, WRFry, DWNelson, JMSlintak, VElliot, WLRoberts, BJVincent, PWPatmore, SJ Tyrosine kinase inhibitors. 15. 4-(Phenylamino)quinazoline and 4-(phenylamino)pyrido[d]pyrimidine acrylamides as irreversible inhibitors of the ATP binding site of the epidermal growth factor receptor. J Med Chem42:1803-15 (1999) 
 
Receptor tyrosine-protein kinase erbB-2
Name:Receptor tyrosine-protein kinase erbB-2
Type:n/a
Mol. Mass.:137894.47
Organism:Homo sapiens (Human)
Description:P04626
Residue:1255
BDBM50077236
NameBDBM50077236
Synonyms:CHEMBL54088 | N-(4-m-Tolylamino-pyrido[3,4-d]pyrimidin-6-yl)-acrylamide
TypeSmall organic molecule
Emp. Form.C17H15N5O
Mol. Mass.305.3339
SMILESCc1cccc(Nc2ncnc3cnc(NC(=O)C=C)cc23)c1