Reaction Details
TargetEpidermal growth factor receptor
LigandBDBM50077244
Substrate/Competitorn/a
Meas. Tech.ChEMBL_66570 (CHEMBL679551)
IC50 4.7±n/a nM
Citation Smaill, JBPalmer, BDRewcastle, GWDenny, WAMcNamara, DJDobrusin, EMBridges, AJZhou, HShowalter, HDWinters, RTLeopold, WRFry, DWNelson, JMSlintak, VElliot, WLRoberts, BJVincent, PWPatmore, SJ Tyrosine kinase inhibitors. 15. 4-(Phenylamino)quinazoline and 4-(phenylamino)pyrido[d]pyrimidine acrylamides as irreversible inhibitors of the ATP binding site of the epidermal growth factor receptor. J Med Chem42:1803-15 (1999) 
 
Epidermal growth factor receptor
Name:Epidermal growth factor receptor
Type:Receptor Kinase Domain
Mol. Mass.:134279.59
Organism:Homo sapiens (Human)
Description:P00533
Residue:1210
BDBM50077244
NameBDBM50077244
Synonyms:CHEMBL31815 | N-(4-m-Tolylamino-quinazolin-6-yl)-acrylamide
TypeSmall organic molecule
Emp. Form.C18H16N4O
Mol. Mass.304.3458
SMILESCc1cccc(Nc2ncnc3ccc(NC(=O)C=C)cc23)c1