Reaction Details
TargetReceptor tyrosine-protein kinase erbB-2
LigandBDBM50077244
Substrate/Competitorn/a
Meas. Tech.ChEMBL_65258 (CHEMBL673949)
IC50 2.2±n/a nM
Citation Smaill, JBPalmer, BDRewcastle, GWDenny, WAMcNamara, DJDobrusin, EMBridges, AJZhou, HShowalter, HDWinters, RTLeopold, WRFry, DWNelson, JMSlintak, VElliot, WLRoberts, BJVincent, PWPatmore, SJ Tyrosine kinase inhibitors. 15. 4-(Phenylamino)quinazoline and 4-(phenylamino)pyrido[d]pyrimidine acrylamides as irreversible inhibitors of the ATP binding site of the epidermal growth factor receptor. J Med Chem42:1803-15 (1999) 
 
Receptor tyrosine-protein kinase erbB-2
Name:Receptor tyrosine-protein kinase erbB-2
Type:n/a
Mol. Mass.:137894.47
Organism:Homo sapiens (Human)
Description:P04626
Residue:1255
BDBM50077244
NameBDBM50077244
Synonyms:CHEMBL31815 | N-(4-m-Tolylamino-quinazolin-6-yl)-acrylamide
TypeSmall organic molecule
Emp. Form.C18H16N4O
Mol. Mass.304.3458
SMILESCc1cccc(Nc2ncnc3ccc(NC(=O)C=C)cc23)c1