Reaction Details
TargetEpidermal growth factor receptor
LigandBDBM4777
Substrate/Competitorn/a
Meas. Tech.ChEMBL_64443 (CHEMBL674018)
IC50 0.91±n/a nM
Citation Smaill, JBPalmer, BDRewcastle, GWDenny, WAMcNamara, DJDobrusin, EMBridges, AJZhou, HShowalter, HDWinters, RTLeopold, WRFry, DWNelson, JMSlintak, VElliot, WLRoberts, BJVincent, PWPatmore, SJ Tyrosine kinase inhibitors. 15. 4-(Phenylamino)quinazoline and 4-(phenylamino)pyrido[d]pyrimidine acrylamides as irreversible inhibitors of the ATP binding site of the epidermal growth factor receptor. J Med Chem42:1803-15 (1999) 
 
Epidermal growth factor receptor
Name:Epidermal growth factor receptor
Type:Receptor Kinase Domain
Mol. Mass.:134279.59
Organism:Homo sapiens (Human)
Description:P00533
Residue:1210
BDBM4777
NameBDBM4777
Synonyms:4-Anilinopyrido[3,4-d]pyrimidine 3 N-{4-[(3-bromophenyl)amino]pyrido[3,4-d]pyrimidin-6-yl}prop-2-enamide
TypeSmall organic molecule
Emp. Form.C16H12BrN5O
Mol. Mass.370.203
SMILESBrc1cccc(Nc2ncnc3cnc(NC(=O)C=C)cc23)c1