Reaction Details
TargetEpidermal growth factor receptor
LigandBDBM50077247
Substrate/Competitorn/a
Meas. Tech.ChEMBL_64443 (CHEMBL674018)
IC50 0.4±n/a nM
Citation Smaill, JBPalmer, BDRewcastle, GWDenny, WAMcNamara, DJDobrusin, EMBridges, AJZhou, HShowalter, HDWinters, RTLeopold, WRFry, DWNelson, JMSlintak, VElliot, WLRoberts, BJVincent, PWPatmore, SJ Tyrosine kinase inhibitors. 15. 4-(Phenylamino)quinazoline and 4-(phenylamino)pyrido[d]pyrimidine acrylamides as irreversible inhibitors of the ATP binding site of the epidermal growth factor receptor. J Med Chem42:1803-15 (1999) 
 
Epidermal growth factor receptor
Name:Epidermal growth factor receptor
Type:Receptor Kinase Domain
Mol. Mass.:134279.59
Organism:Homo sapiens (Human)
Description:P00533
Residue:1210
BDBM50077247
NameBDBM50077247
Synonyms:CHEMBL51741 | N-[4-(6-Bromo-2,3-dihydro-indol-1-yl)-quinazolin-6-yl]-acrylamide
TypeSmall organic molecule
Emp. Form.C19H15BrN4O
Mol. Mass.395.253
SMILESBrc1ccc2CCN(c2c1)c1ncnc2ccc(NC(=O)C=C)cc12