Reaction Details
TargetIntegrase
LigandBDBM50077360
Substrate/Competitorn/a
Meas. Tech.ChEMBL_88774 (CHEMBL878464)
IC50 1000±n/a nM
Citation Reddy, MVRao, MRRhodes, DHansen, MSRubins, KBushman, FDVenkateswarlu, YFaulkner, DJ Lamellarin alpha 20-sulfate, an inhibitor of HIV-1 integrase active against HIV-1 virus in cell culture. J Med Chem42:1901-7 (1999) 
 
Integrase
Name:Integrase
Synonyms:Human immunodeficiency virus type 1 integrase
Type:PROTEIN
Mol. Mass.:32231.48
Organism:Human immunodeficiency virus 1
Description:ChEMBL_90865
Residue:288
BDBM50077360
NameBDBM50077360
TypeSmall organic molecule
Emp. Form.C28H21NO8
Mol. Mass.499.4682
SMILESCOc1ccc(cc1O)-c1c2c(n3ccc4cc(O)c(OC)cc4c13)c(=O)oc1cc(O)c(OC)cc21