Reaction Details
TargetPhenylethanolamine N-methyltransferase
LigandBDBM13016
Substrate/Competitorn/a
Meas. Tech.ChEMBL_152395 (CHEMBL765518)
Ki 10000±n/a nM
Citation Grunewald, GLDahanukar, VHTeoh, BCriscione, KR 3,7-Disubstituted-1,2,3,4-tetrahydroisoquinolines display remarkable potency and selectivity as inhibitors of phenylethanolamine N-methyltransferase versus the alpha2-adrenoceptor. J Med Chem42:1982-90 (1999) 
 
Phenylethanolamine N-methyltransferase
Name:Phenylethanolamine N-methyltransferase
Type:Enzyme
Mol. Mass.:30916.97
Organism:Bos taurus (bovine)
Description:n/a
Residue:283
BDBM13016
NameBDBM13016
Synonyms:1,2,3,4-tetrahydroisoquinoline THIQ 6 | tetrahydroisoquinoline
TypeSmall organic molecule
Emp. Form.C9H11N
Mol. Mass.133.1903
SMILESC1Cc2ccccc2CN1