Reaction Details
TargetD(2) dopamine receptor
LigandBDBM50077577
Substrate/Competitorn/a
Meas. Tech.ChEMBL_62888 (CHEMBL675973)
Ki 0.150000±n/a nM
Citation Mewshaw, REWebb, MBMarquis, KLMcGaughey, GBShi, XWasik, TScerni, RBrennan, JAAndree, TH New generation dopaminergic agents. 6. Structure-activity relationship studies of a series of 4-(aminoethoxy)indole and 4-(aminoethoxy)indolone derivatives based on the newly discovered 3-hydroxyphenoxyethylamine D2 template. J Med Chem42:2007-20 (1999) 
 
D(2) dopamine receptor
Name:D(2) dopamine receptor
Type:G Protein-Coupled Receptor (GPCR)
Mol. Mass.:50931.60
Organism:Rattus norvegicus (rat)
Description:P61169
Residue:444
BDBM50077577
NameBDBM50077577
Synonyms:7-Fluoro-4-{2-[3-(1H-indol-3-yl)-propylamino]-ethoxy}-1,3-dihydro-indol-2-one | CHEMBL60265
TypeSmall organic molecule
Emp. Form.C21H22FN3O2
Mol. Mass.367.4167
SMILESFc1ccc(OCCNCCCc2c[nH]c3ccccc23)c2CC(=O)Nc12