Reaction Details
TargetD(2) dopamine receptor
LigandBDBM50077602
Substrate/Competitorn/a
Meas. Tech.ChEMBL_62888 (CHEMBL675973)
Ki 0.230000±n/a nM
Citation Mewshaw, REWebb, MBMarquis, KLMcGaughey, GBShi, XWasik, TScerni, RBrennan, JAAndree, TH New generation dopaminergic agents. 6. Structure-activity relationship studies of a series of 4-(aminoethoxy)indole and 4-(aminoethoxy)indolone derivatives based on the newly discovered 3-hydroxyphenoxyethylamine D2 template. J Med Chem42:2007-20 (1999) 
 
D(2) dopamine receptor
Name:D(2) dopamine receptor
Type:G Protein-Coupled Receptor (GPCR)
Mol. Mass.:50931.60
Organism:Rattus norvegicus (rat)
Description:P61169
Residue:444
BDBM50077602
NameBDBM50077602
Synonyms:4-[2-(4-Phenyl-butylamino)-ethoxy]-1,3-dihydro-indol-2-one | CHEMBL61671
TypeSmall organic molecule
Emp. Form.C20H24N2O2
Mol. Mass.324.4168
SMILESO=C1Cc2c(N1)cccc2OCCNCCCCc1ccccc1