Reaction Details
Target5-hydroxytryptamine receptor 1A
LigandBDBM50077588
Substrate/Competitorn/a
Meas. Tech.ChEMBL_1415 (CHEMBL616203)
Ki 0.400000±n/a nM
Citation Mewshaw, REWebb, MBMarquis, KLMcGaughey, GBShi, XWasik, TScerni, RBrennan, JAAndree, TH New generation dopaminergic agents. 6. Structure-activity relationship studies of a series of 4-(aminoethoxy)indole and 4-(aminoethoxy)indolone derivatives based on the newly discovered 3-hydroxyphenoxyethylamine D2 template. J Med Chem42:2007-20 (1999) 
 
5-hydroxytryptamine receptor 1A
Name:5-hydroxytryptamine receptor 1A
Type:G Protein-Coupled Receptor (GPCR)
Mol. Mass.:46445.29
Organism:Rattus norvegicus (rat)
Description:Binding assays were performed using rat hippocampal membranes.
Residue:422
BDBM50077588
NameBDBM50077588
Synonyms:CHEMBL59737 | [2-(1H-Indol-4-yloxy)-ethyl]-(4-phenyl-butyl)-amine
TypeSmall organic molecule
Emp. Form.C20H24N2O
Mol. Mass.308.4174
SMILESC(CCc1ccccc1)CNCCOc1cccc2[nH]ccc12