Reaction Details
TargetD(1A) dopamine receptor
LigandBDBM50033114
Substrate/Competitorn/a
Meas. Tech.ChEMBL_60495 (CHEMBL674251)
Ki 49±n/a nM
Citation Gu, YGBayburt, EKMichaelides, MRLin, CWShiosaki, K trans-2,6-,3,6- and 4,6-diaza-5,6,6a,7,8,12b-hexahydro-benzo[c]phenanthrene-10,11- diols as dopamine agonists. Bioorg Med Chem Lett9:1341-6 (1999) D(1A) dopamine receptor
Name:D(1A) dopamine receptor
Type:Enzyme
Mol. Mass.:49303.43
Organism:Homo sapiens (Human)
Description:P21728
Residue:446
BDBM50033114
NameBDBM50033114
Synonyms:(5aR,11bS)-2-Propyl-4,5,5a,6,7,11b-hexahydro-3-thia-5-aza-cyclopenta[c]phenanthrene-9,10-diol A-86929 | CHEMBL28338
TypeSmall organic molecule
Emp. Form.C18H21NO2S
Mol. Mass.315.43
SMILESCCCc1cc2[C@H]3[C@@H](CCc4cc(O)c(O)cc34)NCc2s1