Reaction Details
TargetD(1A) dopamine receptor
LigandBDBM50077631
Substrate/Competitorn/a
Meas. Tech.ChEMBL_60495 (CHEMBL674251)
Ki 49±n/a nM
Citation Gu, YGBayburt, EKMichaelides, MRLin, CWShiosaki, K trans-2,6-,3,6- and 4,6-diaza-5,6,6a,7,8,12b-hexahydro-benzo[c]phenanthrene-10,11- diols as dopamine agonists. Bioorg Med Chem Lett9:1341-6 (1999) D(1A) dopamine receptor
Name:D(1A) dopamine receptor
Type:Enzyme
Mol. Mass.:49303.43
Organism:Homo sapiens (Human)
Description:P21728
Residue:446
BDBM50077631
NameBDBM50077631
Synonyms:(6aR,12bS)-3-Methoxy-5,6,6a,7,8,12b-hexahydro-4,6-diaza-benzo[c]phenanthrene-10,11-diol | CHEMBL285924
TypeSmall organic molecule
Emp. Form.C17H18N2O3
Mol. Mass.298.3364
SMILESCOc1ccc2[C@H]3[C@@H](CCc4cc(O)c(O)cc34)NCc2n1