Reaction Details
TargetD(2) dopamine receptor
LigandBDBM50077658
Substrate/Competitorn/a
Meas. Tech.ChEBML_62868
Ki 195±n/a nM
Citation Ahn, KHLee, SJLee, CHHong, CYPark, TK N-substituted-3-arylpyrrolidines: potent and selective ligands at serotonin 1A receptor. Bioorg Med Chem Lett9:1379-84 (1999) D(2) dopamine receptor
Name:D(2) dopamine receptor
Type:G Protein-Coupled Receptor (GPCR)
Mol. Mass.:50931.60
Organism:Rattus norvegicus (rat)
Description:P61169
Residue:444
BDBM50077658
NameBDBM50077658
Synonyms:1,1-Dioxo-2-[4-(3-phenyl-pyrrolidin-1-yl)-butyl]-1,2-dihydro-1lambda*6*-benzo[d]isothiazol-3-one | CHEMBL28831
TypeSmall organic molecule
Emp. Form.C21H24N2O3S
Mol. Mass.384.492
SMILESO=C1N(CCCCN2CCC(C2)c2ccccc2)S(=O)(=O)c2ccccc12