Reaction Details
Target5-hydroxytryptamine receptor 1A
LigandBDBM50077661
Substrate/Competitorn/a
Meas. Tech.ChEBML_202317
Ki 2.6±n/a nM
Citation Ahn, KHLee, SJLee, CHHong, CYPark, TK N-substituted-3-arylpyrrolidines: potent and selective ligands at serotonin 1A receptor. Bioorg Med Chem Lett9:1379-84 (1999) 5-hydroxytryptamine receptor 1A
Name:5-hydroxytryptamine receptor 1A
Type:G Protein-Coupled Receptor (GPCR)
Mol. Mass.:46445.29
Organism:Rattus norvegicus (rat)
Description:Binding assays were performed using rat hippocampal membranes.
Residue:422
BDBM50077661
NameBDBM50077661
Synonyms:2-{4-[3-(4-Chloro-phenyl)-pyrrolidin-1-yl]-butyl}-1,1-dioxo-1,2-dihydro-1lambda*6*-benzo[d]isothiazol-3-one | CHEMBL28946
TypeSmall organic molecule
Emp. Form.C21H23ClN2O3S
Mol. Mass.418.937
SMILESClc1ccc(cc1)C1CCN(CCCCN2C(=O)c3ccccc3S2(=O)=O)C1