Reaction Details
TargetRenin
LigandBDBM50077702
Substrate/Competitorn/a
Meas. Tech.ChEMBL_195757 (CHEMBL803424)
IC50 0.400000±n/a nM
Citation Güller, RBinggeli, ABreu, VBur, DFischli, WHirth, GJenny, CKansy, MMontavon, FMüller, MOefner, CStadler, HVieira, EWilhelm, MWostl, WMärki, HP Piperidine-renin inhibitors compounds with improved physicochemical properties. Bioorg Med Chem Lett9:1403-8 (1999) Renin
Name:Renin
Type:Enzyme
Mol. Mass.:45058.99
Organism:Homo sapiens (Human)
Description:n/a
Residue:406
BDBM50077702
NameBDBM50077702
Synonyms:4-[(3S,4R,5R)-4-[4-(3-Benzyloxy-propoxy)-phenyl]-5-(naphthalen-2-ylmethoxy)-piperidin-3-ylmethylsulfanyl]-pyridine | CHEMBL286413
TypeSmall organic molecule
Emp. Form.C38H40N2O3S
Mol. Mass.604.801
SMILESC(COCc1ccccc1)COc1ccc(cc1)[C@H]1[C@H](CSc2ccncc2)CNC[C@@H]1OCc1ccc2ccccc2c1